{"text_format":"1","workbook":"xlsx","n_sheets":6,"sheets":["Ansökan","Bilaga 2","Preparat","Bilaga 3","Bilaga 3 (1)","Grödor"],"not_rendered":{"charts":0,"images":6,"macros":1,"external_links":0,"defined_names":12,"comments":3,"pivot_tables":0},"unopened":[],"bounds":{"document_bytes":16777216,"sheet_cells":100000,"rows_first":2000,"rows_last":500,"rows_between":2000,"halvings":0,"cell_chars":16384,"cell_head_chars":4096},"cells_cut":0,"cells_raw":0,"read":"whole","date_system":"1900"}

{"sheet":"Ansökan","index":0,"n_rows":100,"n_cols":9,"rows_kept":100,"cut":false,"hidden":false,"merged":[[68,0,68,4],[67,0,67,4],[38,0,38,4],[37,0,37,4],[43,0,43,8],[44,0,44,8],[45,0,45,8],[46,0,46,1],[46,2,46,5],[46,7,46,8],[37,5,37,8],[38,5,38,8],[47,0,47,7],[41,0,41,4],[41,5,41,8],[57,0,57,4],[19,0,21,8],[17,0,17,8],[15,5,15,8],[13,5,13,8],[15,0,15,4],[13,0,13,4],[16,0,16,8],[18,0,18,8],[9,0,9,8],[10,0,10,4],[10,5,10,6],[10,7,10,8],[8,0,8,8],[12,0,12,4],[12,5,12,8],[11,0,11,4],[14,0,14,4],[14,5,14,8],[11,5,11,6],[11,7,11,8],[22,0,22,8],[26,0,26,4],[26,5,26,8],[27,0,27,4],[27,5,27,8],[23,0,23,8],[33,0,33,4],[33,5,33,8],[28,5,28,8],[29,5,29,8],[30,5,30,8],[31,5,31,8],[31,0,31,4],[30,0,30,4],[29,0,29,4],[28,0,28,4],[32,5,32,8],[32,0,32,4],[57,5,57,8],[50,0,50,8],[51,0,51,8],[34,0,34,4],[34,5,34,8],[35,0,35,4],[35,5,35,8],[36,5,36,8],[36,0,36,4],[39,0,39,4],[39,5,39,8],[40,0,40,4],[40,5,40,8],[63,1,63,3],[63,5,63,6],[64,0,64,3],[64,7,64,8],[58,0,58,4],[58,5,58,8],[60,3,60,4],[60,7,60,8],[75,0,75,4],[75,5,75,8],[76,0,76,4],[76,5,76,8],[69,0,69,4],[70,0,70,4],[72,0,72,8],[73,0,73,8]]}
[null,null,null,null,"Ansökan om tillstånd för yrkesmässig spridning"]
[null,null,null,null,"av bekämpningsmedel inom skyddsområde för"]
[null,null,null,null,"vattentäkt "]
[null,null,null,null,"Naturvårdsverkets författning SNFS 2015:2 "]
[]
[null,null,null,null,"Tillstånd ska sökas av den som avser utföra spridningen eller, efter"]
[null,null,null,null,"skriftlig överenskommelse dem emellan, av den som nyttjar marken."]
["Sökande"]
["Namn"]
[]
["Adress",null,null,null,null,"Postnummer",null,"Ort"]
[]
["Telefonnummer",null,null,null,null,"Mobilnummer"]
[]
["E-postadress",null,null,null,null,"Faxnummer"]
[]
["Organisationsnummer/Personnummer"]
[]
["Fastighetsbeteckning(ar) för vilka tillstånd söks"]
[]
{"$rows_left_out":81}
{"sheet":"Bilaga 2","index":1,"n_rows":72,"n_cols":9,"rows_kept":72,"cut":false,"hidden":false,"merged":[[32,0,32,1],[33,0,33,1],[34,0,34,1],[35,0,35,1],[26,0,26,1],[27,0,27,1],[28,0,28,1],[29,0,29,1],[30,0,30,1],[31,0,31,1],[40,0,40,1],[36,0,36,1],[37,0,37,1],[38,0,38,1],[39,0,39,1],[25,0,25,1],[16,0,16,1],[17,0,17,1],[18,0,18,1],[12,0,12,1],[13,0,13,1],[14,0,14,1],[15,0,15,1],[20,0,20,1],[21,0,21,1],[22,0,22,1],[23,0,23,1],[24,0,24,1],[19,0,19,1],[2,1,2,8],[9,0,9,1],[10,0,10,1],[11,0,11,1],[7,0,7,1],[8,0,8,1],[45,0,45,1],[46,0,46,1],[47,0,47,1],[48,0,48,1],[41,0,41,1],[42,0,42,1],[43,0,43,1],[44,0,44,1],[53,0,53,1],[54,0,54,1],[55,0,55,1],[56,0,56,1],[49,0,49,1],[50,0,50,1],[51,0,51,1],[52,0,52,1],[61,0,61,1],[62,0,62,1],[63,0,63,1],[64,0,64,1],[57,0,57,1],[58,0,58,1],[59,0,59,1],[60,0,60,1],[69,0,69,1],[70,0,70,1],[71,0,71,1],[65,0,65,1],[66,0,66,1],[67,0,67,1],[68,0,68,1]]}
["Ansökan om tillstånd",null,null,null,null,null,null,null,"Bilaga 2"]
[]
["Sökande:",{"$f":"IF(Ansökan!$A$10=0,\"\",Ansökan!$A$10)","v":""}]
["Information om blanketten:"]
["Blanketten är självinstruerande, flytta musen över blanketten och aktell information visas"]
["Om skiftet har både låg lerhalt och låg mullhalt indikeras automatiskt genomsläpplig i rutan för markförhållande.  "]
["Om markförhållande genomsläpplig är indikerad bör speciell hänsyn tas vid preparatval och dos."]
["Skifte",null,"pH","Lerhalt (%)","Mullhalt (%)","Markförhållande","Gröda 2026","Gröda 2027","Gröda 2028"]
[null,null,null,null,null,{"$f":"IF(AND(D9<Grödor!$F$2,E9<Grödor!$G$2,D9<>0,E9<>0),\"genomsläpplig\",\"\")","v":""}]
[null,null,null,null,null,{"$f":"IF(AND(D10<Grödor!$F$2,E10<Grödor!$G$2,D10<>0,E10<>0),\"genomsläpplig\",\"\")","v":""}]
[null,null,null,null,null,{"$f":"IF(AND(D11<Grödor!$F$2,E11<Grödor!$G$2,D11<>0,E11<>0),\"genomsläpplig\",\"\")","v":""}]
[null,null,null,null,null,{"$f":"IF(AND(D12<Grödor!$F$2,E12<Grödor!$G$2,D12<>0,E12<>0),\"genomsläpplig\",\"\")","v":""}]
[null,null,null,null,null,{"$f":"IF(AND(D13<Grödor!$F$2,E13<Grödor!$G$2,D13<>0,E13<>0),\"genomsläpplig\",\"\")","v":""}]
[null,null,null,null,null,{"$f":"IF(AND(D14<Grödor!$F$2,E14<Grödor!$G$2,D14<>0,E14<>0),\"genomsläpplig\",\"\")","v":""}]
[null,null,null,null,null,{"$f":"IF(AND(D15<Grödor!$F$2,E15<Grödor!$G$2,D15<>0,E15<>0),\"genomsläpplig\",\"\")","v":""}]
[null,null,null,null,null,{"$f":"IF(AND(D16<Grödor!$F$2,E16<Grödor!$G$2,D16<>0,E16<>0),\"genomsläpplig\",\"\")","v":""}]
[null,null,null,null,null,{"$f":"IF(AND(D17<Grödor!$F$2,E17<Grödor!$G$2,D17<>0,E17<>0),\"genomsläpplig\",\"\")","v":""}]
[null,null,null,null,null,{"$f":"IF(AND(D18<Grödor!$F$2,E18<Grödor!$G$2,D18<>0,E18<>0),\"genomsläpplig\",\"\")","v":""}]
[null,null,null,null,null,{"$f":"IF(AND(D19<Grödor!$F$2,E19<Grödor!$G$2,D19<>0,E19<>0),\"genomsläpplig\",\"\")","v":""}]
[null,null,null,null,null,{"$f":"IF(AND(D20<Grödor!$F$2,E20<Grödor!$G$2,D20<>0,E20<>0),\"genomsläpplig\",\"\")","v":""}]
{"$rows_left_out":53}
{"sheet":"Preparat","index":2,"n_rows":322,"n_cols":7,"rows_kept":322,"cut":false,"hidden":true,"merged":[]}
["Preparatnamn","Regnr","Klass","Anv. Förbud","Läckagerisk","Läckagerisk GUL","Övrigt"]
["Acanto",4773,"2 L",null,null,null,"Bedöms av SANCO att finns potential för läckage till grundvatte i områden med känsliga jordar och klimat."]
["Acanto Prima",4785,"2 L","2013-05-01",null,null,"Bedöms av SANCO att finns potential för läckage till grundvatte i områden med känsliga jordar och klimat."]
["Acrobat WG",4201,"1 L",null,null,null,"Bedöms av SANCO att finns potential för läckage till grundvatte i områden med känsliga jordar och klimat."]
["Admiral 10 EC",4557,"2 L"]
["ALAR 85 SG",4329,"1 L",null,"Läck.Risk i genomsläpplig mark"]
["Aliette 80 WG",4048,"2 L"]
["ALLY 50 ST ",4727,"2 L"]
["Ally Class 50 WG ",4404,"2 L"]
["Ambly-line cu",4445]
["Amblyseius-System",4148]
["Amistar",4219,"2 L"]
["Aphidend",4155]
["Aphidius-Mix-System",4618]
["Aphidius-System",4204]
["Aphidoletes system",4147]
["Aphido-line a",4447]
["Aphi-line c",4446]
["Aphi-line e",4497]
["Aphipar",4205]
{"$rows_left_out":303}
{"sheet":"Bilaga 3","index":3,"n_rows":41,"n_cols":8,"rows_kept":41,"cut":false,"hidden":true,"merged":[[2,1,2,7],[8,7,9,7],[8,1,8,5]]}
["Ansökan om tillstånd",null,null,null,null,null,null,"Bilaga 3"]
[]
["Sökande:",{"$f":"IF(Ansökan!$A$10=0,\"\",Ansökan!$A$10)","v":""}]
[]
["Gröda:"]
[]
["Blanketten är självinstruerande. Flytta musen över blanketten och aktell information visas"]
[]
["Tidpunkt","Preparat",null,null,null,null,"Totaldos","Anteckningar"]
["(Månad)","Preparatnamnamn","Regnr","Klass","Läckagerisk",null,"per hektar"]
[null,null,{"$f":"IF(ISNA(VLOOKUP(B11,Preparat!$A$2:$E$322,2,FALSE)),\"\",VLOOKUP(B11,Preparat!$A$2:$E$322,2))","v":""},{"$f":"IF(IF(ISNA(VLOOKUP(B11,Preparat!$A$2:$E$322,3,FALSE)),\"\",VLOOKUP(B11,Preparat!$A$2:$E$322,3))=0,\"\",IF(ISNA(VLOOKUP(B11,Preparat!$A$2:$E$322,3,FALSE)),\"\",VLOOKUP(B11,Preparat!$A$2:$E$322,3)))","v":""},{"$f":"IF(IF(ISNA(VLOOKUP(B11,Preparat!$A$2:$E$9998,5,FALSE)),\"\",VLOOKUP(B11,Preparat!$A$2:$E$9998,5))=0,\"\",IF(ISNA(VLOOKUP(B11,Preparat!$A$2:$E$9998,5,FALSE)),\"\",VLOOKUP(B11,Preparat!$A$2:$E$9998,5)))","v":""},{"$f":"IF(IF(ISNA(VLOOKUP(B11,Preparat!$A$2:$E$322,4,FALSE)),\"\",VLOOKUP(B11,Preparat!$A$2:$E$322,4))<1901-1-1,\"\",IF(ISNA(VLOOKUP(B11,Preparat!$A$2:$E$322,4,FALSE)),\"\",VLOOKUP(B11,Preparat!$A$2:$E$322,4)))","v":""}]
[null,null,{"$f":"IF(ISNA(VLOOKUP(B12,Preparat!$A$2:$E$322,2,FALSE)),\"\",VLOOKUP(B12,Preparat!$A$2:$E$322,2))","v":""},{"$f":"IF(IF(ISNA(VLOOKUP(B12,Preparat!$A$2:$E$322,3,FALSE)),\"\",VLOOKUP(B12,Preparat!$A$2:$E$322,3))=0,\"\",IF(ISNA(VLOOKUP(B12,Preparat!$A$2:$E$322,3,FALSE)),\"\",VLOOKUP(B12,Preparat!$A$2:$E$322,3)))","v":""},{"$f":"IF(IF(ISNA(VLOOKUP(B12,Preparat!$A$2:$E$9998,5,FALSE)),\"\",VLOOKUP(B12,Preparat!$A$2:$E$9998,5))=0,\"\",IF(ISNA(VLOOKUP(B12,Preparat!$A$2:$E$9998,5,FALSE)),\"\",VLOOKUP(B12,Preparat!$A$2:$E$9998,5)))","v":""},{"$f":"IF(IF(ISNA(VLOOKUP(B12,Preparat!$A$2:$E$322,4,FALSE)),\"\",VLOOKUP(B12,Preparat!$A$2:$E$322,4))<1901-1-1,\"\",IF(ISNA(VLOOKUP(B12,Preparat!$A$2:$E$322,4,FALSE)),\"\",VLOOKUP(B12,Preparat!$A$2:$E$322,4)))","v":""}]
[null,null,{"$f":"IF(ISNA(VLOOKUP(B13,Preparat!$A$2:$E$322,2,FALSE)),\"\",VLOOKUP(B13,Preparat!$A$2:$E$322,2))","v":""},{"$f":"IF(IF(ISNA(VLOOKUP(B13,Preparat!$A$2:$E$322,3,FALSE)),\"\",VLOOKUP(B13,Preparat!$A$2:$E$322,3))=0,\"\",IF(ISNA(VLOOKUP(B13,Preparat!$A$2:$E$322,3,FALSE)),\"\",VLOOKUP(B13,Preparat!$A$2:$E$322,3)))","v":""},{"$f":"IF(IF(ISNA(VLOOKUP(B13,Preparat!$A$2:$E$9998,5,FALSE)),\"\",VLOOKUP(B13,Preparat!$A$2:$E$9998,5))=0,\"\",IF(ISNA(VLOOKUP(B13,Preparat!$A$2:$E$9998,5,FALSE)),\"\",VLOOKUP(B13,Preparat!$A$2:$E$9998,5)))","v":""},{"$f":"IF(IF(ISNA(VLOOKUP(B13,Preparat!$A$2:$E$322,4,FALSE)),\"\",VLOOKUP(B13,Preparat!$A$2:$E$322,4))<1901-1-1,\"\",IF(ISNA(VLOOKUP(B13,Preparat!$A$2:$E$322,4,FALSE)),\"\",VLOOKUP(B13,Preparat!$A$2:$E$322,4)))","v":""}]
[null,null,{"$f":"IF(ISNA(VLOOKUP(B14,Preparat!$A$2:$E$322,2,FALSE)),\"\",VLOOKUP(B14,Preparat!$A$2:$E$322,2))","v":""},{"$f":"IF(IF(ISNA(VLOOKUP(B14,Preparat!$A$2:$E$322,3,FALSE)),\"\",VLOOKUP(B14,Preparat!$A$2:$E$322,3))=0,\"\",IF(ISNA(VLOOKUP(B14,Preparat!$A$2:$E$322,3,FALSE)),\"\",VLOOKUP(B14,Preparat!$A$2:$E$322,3)))","v":""},{"$f":"IF(IF(ISNA(VLOOKUP(B14,Preparat!$A$2:$E$9998,5,FALSE)),\"\",VLOOKUP(B14,Preparat!$A$2:$E$9998,5))=0,\"\",IF(ISNA(VLOOKUP(B14,Preparat!$A$2:$E$9998,5,FALSE)),\"\",VLOOKUP(B14,Preparat!$A$2:$E$9998,5)))","v":""},{"$f":"IF(IF(ISNA(VLOOKUP(B14,Preparat!$A$2:$E$322,4,FALSE)),\"\",VLOOKUP(B14,Preparat!$A$2:$E$322,4))<1901-1-1,\"\",IF(ISNA(VLOOKUP(B14,Preparat!$A$2:$E$322,4,FALSE)),\"\",VLOOKUP(B14,Preparat!$A$2:$E$322,4)))","v":""}]
[null,null,{"$f":"IF(ISNA(VLOOKUP(B15,Preparat!$A$2:$E$322,2,FALSE)),\"\",VLOOKUP(B15,Preparat!$A$2:$E$322,2))","v":""},{"$f":"IF(IF(ISNA(VLOOKUP(B15,Preparat!$A$2:$E$322,3,FALSE)),\"\",VLOOKUP(B15,Preparat!$A$2:$E$322,3))=0,\"\",IF(ISNA(VLOOKUP(B15,Preparat!$A$2:$E$322,3,FALSE)),\"\",VLOOKUP(B15,Preparat!$A$2:$E$322,3)))","v":""},{"$f":"IF(IF(ISNA(VLOOKUP(B15,Preparat!$A$2:$E$9998,5,FALSE)),\"\",VLOOKUP(B15,Preparat!$A$2:$E$9998,5))=0,\"\",IF(ISNA(VLOOKUP(B15,Preparat!$A$2:$E$9998,5,FALSE)),\"\",VLOOKUP(B15,Preparat!$A$2:$E$9998,5)))","v":""},{"$f":"IF(IF(ISNA(VLOOKUP(B15,Preparat!$A$2:$E$322,4,FALSE)),\"\",VLOOKUP(B15,Preparat!$A$2:$E$322,4))<1901-1-1,\"\",IF(ISNA(VLOOKUP(B15,Preparat!$A$2:$E$322,4,FALSE)),\"\",VLOOKUP(B15,Preparat!$A$2:$E$322,4)))","v":""}]
[null,null,{"$f":"IF(ISNA(VLOOKUP(B16,Preparat!$A$2:$E$322,2,FALSE)),\"\",VLOOKUP(B16,Preparat!$A$2:$E$322,2))","v":""},{"$f":"IF(IF(ISNA(VLOOKUP(B16,Preparat!$A$2:$E$322,3,FALSE)),\"\",VLOOKUP(B16,Preparat!$A$2:$E$322,3))=0,\"\",IF(ISNA(VLOOKUP(B16,Preparat!$A$2:$E$322,3,FALSE)),\"\",VLOOKUP(B16,Preparat!$A$2:$E$322,3)))","v":""},{"$f":"IF(IF(ISNA(VLOOKUP(B16,Preparat!$A$2:$E$9998,5,FALSE)),\"\",VLOOKUP(B16,Preparat!$A$2:$E$9998,5))=0,\"\",IF(ISNA(VLOOKUP(B16,Preparat!$A$2:$E$9998,5,FALSE)),\"\",VLOOKUP(B16,Preparat!$A$2:$E$9998,5)))","v":""},{"$f":"IF(IF(ISNA(VLOOKUP(B16,Preparat!$A$2:$E$322,4,FALSE)),\"\",VLOOKUP(B16,Preparat!$A$2:$E$322,4))<1901-1-1,\"\",IF(ISNA(VLOOKUP(B16,Preparat!$A$2:$E$322,4,FALSE)),\"\",VLOOKUP(B16,Preparat!$A$2:$E$322,4)))","v":""}]
[null,null,{"$f":"IF(ISNA(VLOOKUP(B17,Preparat!$A$2:$E$322,2,FALSE)),\"\",VLOOKUP(B17,Preparat!$A$2:$E$322,2))","v":""},{"$f":"IF(IF(ISNA(VLOOKUP(B17,Preparat!$A$2:$E$322,3,FALSE)),\"\",VLOOKUP(B17,Preparat!$A$2:$E$322,3))=0,\"\",IF(ISNA(VLOOKUP(B17,Preparat!$A$2:$E$322,3,FALSE)),\"\",VLOOKUP(B17,Preparat!$A$2:$E$322,3)))","v":""},{"$f":"IF(IF(ISNA(VLOOKUP(B17,Preparat!$A$2:$E$9998,5,FALSE)),\"\",VLOOKUP(B17,Preparat!$A$2:$E$9998,5))=0,\"\",IF(ISNA(VLOOKUP(B17,Preparat!$A$2:$E$9998,5,FALSE)),\"\",VLOOKUP(B17,Preparat!$A$2:$E$9998,5)))","v":""},{"$f":"IF(IF(ISNA(VLOOKUP(B17,Preparat!$A$2:$E$322,4,FALSE)),\"\",VLOOKUP(B17,Preparat!$A$2:$E$322,4))<1901-1-1,\"\",IF(ISNA(VLOOKUP(B17,Preparat!$A$2:$E$322,4,FALSE)),\"\",VLOOKUP(B17,Preparat!$A$2:$E$322,4)))","v":""}]
[null,null,{"$f":"IF(ISNA(VLOOKUP(B18,Preparat!$A$2:$E$322,2,FALSE)),\"\",VLOOKUP(B18,Preparat!$A$2:$E$322,2))","v":""},{"$f":"IF(IF(ISNA(VLOOKUP(B18,Preparat!$A$2:$E$322,3,FALSE)),\"\",VLOOKUP(B18,Preparat!$A$2:$E$322,3))=0,\"\",IF(ISNA(VLOOKUP(B18,Preparat!$A$2:$E$322,3,FALSE)),\"\",VLOOKUP(B18,Preparat!$A$2:$E$322,3)))","v":""},{"$f":"IF(IF(ISNA(VLOOKUP(B18,Preparat!$A$2:$E$9998,5,FALSE)),\"\",VLOOKUP(B18,Preparat!$A$2:$E$9998,5))=0,\"\",IF(ISNA(VLOOKUP(B18,Preparat!$A$2:$E$9998,5,FALSE)),\"\",VLOOKUP(B18,Preparat!$A$2:$E$9998,5)))","v":""},{"$f":"IF(IF(ISNA(VLOOKUP(B18,Preparat!$A$2:$E$322,4,FALSE)),\"\",VLOOKUP(B18,Preparat!$A$2:$E$322,4))<1901-1-1,\"\",IF(ISNA(VLOOKUP(B18,Preparat!$A$2:$E$322,4,FALSE)),\"\",VLOOKUP(B18,Preparat!$A$2:$E$322,4)))","v":""}]
[null,null,{"$f":"IF(ISNA(VLOOKUP(B19,Preparat!$A$2:$E$322,2,FALSE)),\"\",VLOOKUP(B19,Preparat!$A$2:$E$322,2))","v":""},{"$f":"IF(IF(ISNA(VLOOKUP(B19,Preparat!$A$2:$E$322,3,FALSE)),\"\",VLOOKUP(B19,Preparat!$A$2:$E$322,3))=0,\"\",IF(ISNA(VLOOKUP(B19,Preparat!$A$2:$E$322,3,FALSE)),\"\",VLOOKUP(B19,Preparat!$A$2:$E$322,3)))","v":""},{"$f":"IF(IF(ISNA(VLOOKUP(B19,Preparat!$A$2:$E$9998,5,FALSE)),\"\",VLOOKUP(B19,Preparat!$A$2:$E$9998,5))=0,\"\",IF(ISNA(VLOOKUP(B19,Preparat!$A$2:$E$9998,5,FALSE)),\"\",VLOOKUP(B19,Preparat!$A$2:$E$9998,5)))","v":""},{"$f":"IF(IF(ISNA(VLOOKUP(B19,Preparat!$A$2:$E$322,4,FALSE)),\"\",VLOOKUP(B19,Preparat!$A$2:$E$322,4))<1901-1-1,\"\",IF(ISNA(VLOOKUP(B19,Preparat!$A$2:$E$322,4,FALSE)),\"\",VLOOKUP(B19,Preparat!$A$2:$E$322,4)))","v":""}]
[null,null,{"$f":"IF(ISNA(VLOOKUP(B20,Preparat!$A$2:$E$322,2,FALSE)),\"\",VLOOKUP(B20,Preparat!$A$2:$E$322,2))","v":""},{"$f":"IF(IF(ISNA(VLOOKUP(B20,Preparat!$A$2:$E$322,3,FALSE)),\"\",VLOOKUP(B20,Preparat!$A$2:$E$322,3))=0,\"\",IF(ISNA(VLOOKUP(B20,Preparat!$A$2:$E$322,3,FALSE)),\"\",VLOOKUP(B20,Preparat!$A$2:$E$322,3)))","v":""},{"$f":"IF(IF(ISNA(VLOOKUP(B20,Preparat!$A$2:$E$9998,5,FALSE)),\"\",VLOOKUP(B20,Preparat!$A$2:$E$9998,5))=0,\"\",IF(ISNA(VLOOKUP(B20,Preparat!$A$2:$E$9998,5,FALSE)),\"\",VLOOKUP(B20,Preparat!$A$2:$E$9998,5)))","v":""},{"$f":"IF(IF(ISNA(VLOOKUP(B20,Preparat!$A$2:$E$322,4,FALSE)),\"\",VLOOKUP(B20,Preparat!$A$2:$E$322,4))<1901-1-1,\"\",IF(ISNA(VLOOKUP(B20,Preparat!$A$2:$E$322,4,FALSE)),\"\",VLOOKUP(B20,Preparat!$A$2:$E$322,4)))","v":""}]
{"$rows_left_out":22}
{"sheet":"Bilaga 3 (1)","index":4,"n_rows":41,"n_cols":8,"rows_kept":41,"cut":false,"hidden":false,"merged":[[2,1,2,7],[8,7,9,7],[8,1,8,5]]}
["Ansökan om tillstånd",null,null,null,null,null,null,"Bilaga 3"]
[]
["Sökande:",{"$f":"IF(Ansökan!$A$10=0,\"\",Ansökan!$A$10)","v":""}]
[]
["Gröda:"]
[]
["Blanketten är självinstruerande. Flytta musen över blanketten och aktell information visas"]
[]
["Tidpunkt","Preparat",null,null,null,null,"Totaldos","Anteckningar"]
["(Månad)","Preparatnamnamn","Regnr","Klass","Läckagerisk","Anv. Förbud","per hektar"]
[null,null,null,{"$f":"IF(IF(ISNA(VLOOKUP(B11,Preparat!$A$2:$E$322,3,FALSE)),\"\",VLOOKUP(B11,Preparat!$A$2:$E$322,3))=0,\"\",IF(ISNA(VLOOKUP(B11,Preparat!$A$2:$E$322,3,FALSE)),\"\",VLOOKUP(B11,Preparat!$A$2:$E$322,3)))","v":""},{"$f":"IF(IF(ISNA(VLOOKUP(B11,Preparat!$A$2:$E$9998,5,FALSE)),\"\",VLOOKUP(B11,Preparat!$A$2:$E$9998,5))=0,\"\",IF(ISNA(VLOOKUP(B11,Preparat!$A$2:$E$9998,5,FALSE)),\"\",VLOOKUP(B11,Preparat!$A$2:$E$9998,5)))","v":""},{"$f":"IF(IF(ISNA(VLOOKUP(B11,Preparat!$A$2:$E$322,4,FALSE)),\"\",VLOOKUP(B11,Preparat!$A$2:$E$322,4))<1901-1-1,\"\",IF(ISNA(VLOOKUP(B11,Preparat!$A$2:$E$322,4,FALSE)),\"\",VLOOKUP(B11,Preparat!$A$2:$E$322,4)))","v":""}]
[null,null,{"$f":"IF(ISNA(VLOOKUP(B12,Preparat!$A$2:$E$322,2,FALSE)),\"\",VLOOKUP(B12,Preparat!$A$2:$E$322,2))","v":""},{"$f":"IF(IF(ISNA(VLOOKUP(B12,Preparat!$A$2:$E$322,3,FALSE)),\"\",VLOOKUP(B12,Preparat!$A$2:$E$322,3))=0,\"\",IF(ISNA(VLOOKUP(B12,Preparat!$A$2:$E$322,3,FALSE)),\"\",VLOOKUP(B12,Preparat!$A$2:$E$322,3)))","v":""},{"$f":"IF(IF(ISNA(VLOOKUP(B12,Preparat!$A$2:$E$9998,5,FALSE)),\"\",VLOOKUP(B12,Preparat!$A$2:$E$9998,5))=0,\"\",IF(ISNA(VLOOKUP(B12,Preparat!$A$2:$E$9998,5,FALSE)),\"\",VLOOKUP(B12,Preparat!$A$2:$E$9998,5)))","v":""},{"$f":"IF(IF(ISNA(VLOOKUP(B12,Preparat!$A$2:$E$322,4,FALSE)),\"\",VLOOKUP(B12,Preparat!$A$2:$E$322,4))<1901-1-1,\"\",IF(ISNA(VLOOKUP(B12,Preparat!$A$2:$E$322,4,FALSE)),\"\",VLOOKUP(B12,Preparat!$A$2:$E$322,4)))","v":""}]
[null,null,{"$f":"IF(ISNA(VLOOKUP(B13,Preparat!$A$2:$E$322,2,FALSE)),\"\",VLOOKUP(B13,Preparat!$A$2:$E$322,2))","v":""},{"$f":"IF(IF(ISNA(VLOOKUP(B13,Preparat!$A$2:$E$322,3,FALSE)),\"\",VLOOKUP(B13,Preparat!$A$2:$E$322,3))=0,\"\",IF(ISNA(VLOOKUP(B13,Preparat!$A$2:$E$322,3,FALSE)),\"\",VLOOKUP(B13,Preparat!$A$2:$E$322,3)))","v":""},{"$f":"IF(IF(ISNA(VLOOKUP(B13,Preparat!$A$2:$E$9998,5,FALSE)),\"\",VLOOKUP(B13,Preparat!$A$2:$E$9998,5))=0,\"\",IF(ISNA(VLOOKUP(B13,Preparat!$A$2:$E$9998,5,FALSE)),\"\",VLOOKUP(B13,Preparat!$A$2:$E$9998,5)))","v":""},{"$f":"IF(IF(ISNA(VLOOKUP(B13,Preparat!$A$2:$E$322,4,FALSE)),\"\",VLOOKUP(B13,Preparat!$A$2:$E$322,4))<1901-1-1,\"\",IF(ISNA(VLOOKUP(B13,Preparat!$A$2:$E$322,4,FALSE)),\"\",VLOOKUP(B13,Preparat!$A$2:$E$322,4)))","v":""}]
[null,null,{"$f":"IF(ISNA(VLOOKUP(B14,Preparat!$A$2:$E$322,2,FALSE)),\"\",VLOOKUP(B14,Preparat!$A$2:$E$322,2))","v":""},{"$f":"IF(IF(ISNA(VLOOKUP(B14,Preparat!$A$2:$E$322,3,FALSE)),\"\",VLOOKUP(B14,Preparat!$A$2:$E$322,3))=0,\"\",IF(ISNA(VLOOKUP(B14,Preparat!$A$2:$E$322,3,FALSE)),\"\",VLOOKUP(B14,Preparat!$A$2:$E$322,3)))","v":""},{"$f":"IF(IF(ISNA(VLOOKUP(B14,Preparat!$A$2:$E$9998,5,FALSE)),\"\",VLOOKUP(B14,Preparat!$A$2:$E$9998,5))=0,\"\",IF(ISNA(VLOOKUP(B14,Preparat!$A$2:$E$9998,5,FALSE)),\"\",VLOOKUP(B14,Preparat!$A$2:$E$9998,5)))","v":""},{"$f":"IF(IF(ISNA(VLOOKUP(B14,Preparat!$A$2:$E$322,4,FALSE)),\"\",VLOOKUP(B14,Preparat!$A$2:$E$322,4))<1901-1-1,\"\",IF(ISNA(VLOOKUP(B14,Preparat!$A$2:$E$322,4,FALSE)),\"\",VLOOKUP(B14,Preparat!$A$2:$E$322,4)))","v":""}]
[null,null,{"$f":"IF(ISNA(VLOOKUP(B15,Preparat!$A$2:$E$322,2,FALSE)),\"\",VLOOKUP(B15,Preparat!$A$2:$E$322,2))","v":""},{"$f":"IF(IF(ISNA(VLOOKUP(B15,Preparat!$A$2:$E$322,3,FALSE)),\"\",VLOOKUP(B15,Preparat!$A$2:$E$322,3))=0,\"\",IF(ISNA(VLOOKUP(B15,Preparat!$A$2:$E$322,3,FALSE)),\"\",VLOOKUP(B15,Preparat!$A$2:$E$322,3)))","v":""},{"$f":"IF(IF(ISNA(VLOOKUP(B15,Preparat!$A$2:$E$9998,5,FALSE)),\"\",VLOOKUP(B15,Preparat!$A$2:$E$9998,5))=0,\"\",IF(ISNA(VLOOKUP(B15,Preparat!$A$2:$E$9998,5,FALSE)),\"\",VLOOKUP(B15,Preparat!$A$2:$E$9998,5)))","v":""},{"$f":"IF(IF(ISNA(VLOOKUP(B15,Preparat!$A$2:$E$322,4,FALSE)),\"\",VLOOKUP(B15,Preparat!$A$2:$E$322,4))<1901-1-1,\"\",IF(ISNA(VLOOKUP(B15,Preparat!$A$2:$E$322,4,FALSE)),\"\",VLOOKUP(B15,Preparat!$A$2:$E$322,4)))","v":""}]
[null,null,{"$f":"IF(ISNA(VLOOKUP(B16,Preparat!$A$2:$E$322,2,FALSE)),\"\",VLOOKUP(B16,Preparat!$A$2:$E$322,2))","v":""},{"$f":"IF(IF(ISNA(VLOOKUP(B16,Preparat!$A$2:$E$322,3,FALSE)),\"\",VLOOKUP(B16,Preparat!$A$2:$E$322,3))=0,\"\",IF(ISNA(VLOOKUP(B16,Preparat!$A$2:$E$322,3,FALSE)),\"\",VLOOKUP(B16,Preparat!$A$2:$E$322,3)))","v":""},{"$f":"IF(IF(ISNA(VLOOKUP(B16,Preparat!$A$2:$E$9998,5,FALSE)),\"\",VLOOKUP(B16,Preparat!$A$2:$E$9998,5))=0,\"\",IF(ISNA(VLOOKUP(B16,Preparat!$A$2:$E$9998,5,FALSE)),\"\",VLOOKUP(B16,Preparat!$A$2:$E$9998,5)))","v":""},{"$f":"IF(IF(ISNA(VLOOKUP(B16,Preparat!$A$2:$E$322,4,FALSE)),\"\",VLOOKUP(B16,Preparat!$A$2:$E$322,4))<1901-1-1,\"\",IF(ISNA(VLOOKUP(B16,Preparat!$A$2:$E$322,4,FALSE)),\"\",VLOOKUP(B16,Preparat!$A$2:$E$322,4)))","v":""}]
[null,null,{"$f":"IF(ISNA(VLOOKUP(B17,Preparat!$A$2:$E$322,2,FALSE)),\"\",VLOOKUP(B17,Preparat!$A$2:$E$322,2))","v":""},{"$f":"IF(IF(ISNA(VLOOKUP(B17,Preparat!$A$2:$E$322,3,FALSE)),\"\",VLOOKUP(B17,Preparat!$A$2:$E$322,3))=0,\"\",IF(ISNA(VLOOKUP(B17,Preparat!$A$2:$E$322,3,FALSE)),\"\",VLOOKUP(B17,Preparat!$A$2:$E$322,3)))","v":""},{"$f":"IF(IF(ISNA(VLOOKUP(B17,Preparat!$A$2:$E$9998,5,FALSE)),\"\",VLOOKUP(B17,Preparat!$A$2:$E$9998,5))=0,\"\",IF(ISNA(VLOOKUP(B17,Preparat!$A$2:$E$9998,5,FALSE)),\"\",VLOOKUP(B17,Preparat!$A$2:$E$9998,5)))","v":""},{"$f":"IF(IF(ISNA(VLOOKUP(B17,Preparat!$A$2:$E$322,4,FALSE)),\"\",VLOOKUP(B17,Preparat!$A$2:$E$322,4))<1901-1-1,\"\",IF(ISNA(VLOOKUP(B17,Preparat!$A$2:$E$322,4,FALSE)),\"\",VLOOKUP(B17,Preparat!$A$2:$E$322,4)))","v":""}]
[null,null,{"$f":"IF(ISNA(VLOOKUP(B18,Preparat!$A$2:$E$322,2,FALSE)),\"\",VLOOKUP(B18,Preparat!$A$2:$E$322,2))","v":""},{"$f":"IF(IF(ISNA(VLOOKUP(B18,Preparat!$A$2:$E$322,3,FALSE)),\"\",VLOOKUP(B18,Preparat!$A$2:$E$322,3))=0,\"\",IF(ISNA(VLOOKUP(B18,Preparat!$A$2:$E$322,3,FALSE)),\"\",VLOOKUP(B18,Preparat!$A$2:$E$322,3)))","v":""},{"$f":"IF(IF(ISNA(VLOOKUP(B18,Preparat!$A$2:$E$9998,5,FALSE)),\"\",VLOOKUP(B18,Preparat!$A$2:$E$9998,5))=0,\"\",IF(ISNA(VLOOKUP(B18,Preparat!$A$2:$E$9998,5,FALSE)),\"\",VLOOKUP(B18,Preparat!$A$2:$E$9998,5)))","v":""},{"$f":"IF(IF(ISNA(VLOOKUP(B18,Preparat!$A$2:$E$322,4,FALSE)),\"\",VLOOKUP(B18,Preparat!$A$2:$E$322,4))<1901-1-1,\"\",IF(ISNA(VLOOKUP(B18,Preparat!$A$2:$E$322,4,FALSE)),\"\",VLOOKUP(B18,Preparat!$A$2:$E$322,4)))","v":""}]
[null,null,{"$f":"IF(ISNA(VLOOKUP(B19,Preparat!$A$2:$E$322,2,FALSE)),\"\",VLOOKUP(B19,Preparat!$A$2:$E$322,2))","v":""},{"$f":"IF(IF(ISNA(VLOOKUP(B19,Preparat!$A$2:$E$322,3,FALSE)),\"\",VLOOKUP(B19,Preparat!$A$2:$E$322,3))=0,\"\",IF(ISNA(VLOOKUP(B19,Preparat!$A$2:$E$322,3,FALSE)),\"\",VLOOKUP(B19,Preparat!$A$2:$E$322,3)))","v":""},{"$f":"IF(IF(ISNA(VLOOKUP(B19,Preparat!$A$2:$E$9998,5,FALSE)),\"\",VLOOKUP(B19,Preparat!$A$2:$E$9998,5))=0,\"\",IF(ISNA(VLOOKUP(B19,Preparat!$A$2:$E$9998,5,FALSE)),\"\",VLOOKUP(B19,Preparat!$A$2:$E$9998,5)))","v":""},{"$f":"IF(IF(ISNA(VLOOKUP(B19,Preparat!$A$2:$E$322,4,FALSE)),\"\",VLOOKUP(B19,Preparat!$A$2:$E$322,4))<1901-1-1,\"\",IF(ISNA(VLOOKUP(B19,Preparat!$A$2:$E$322,4,FALSE)),\"\",VLOOKUP(B19,Preparat!$A$2:$E$322,4)))","v":""}]
[null,null,{"$f":"IF(ISNA(VLOOKUP(B20,Preparat!$A$2:$E$322,2,FALSE)),\"\",VLOOKUP(B20,Preparat!$A$2:$E$322,2))","v":""},{"$f":"IF(IF(ISNA(VLOOKUP(B20,Preparat!$A$2:$E$322,3,FALSE)),\"\",VLOOKUP(B20,Preparat!$A$2:$E$322,3))=0,\"\",IF(ISNA(VLOOKUP(B20,Preparat!$A$2:$E$322,3,FALSE)),\"\",VLOOKUP(B20,Preparat!$A$2:$E$322,3)))","v":""},{"$f":"IF(IF(ISNA(VLOOKUP(B20,Preparat!$A$2:$E$9998,5,FALSE)),\"\",VLOOKUP(B20,Preparat!$A$2:$E$9998,5))=0,\"\",IF(ISNA(VLOOKUP(B20,Preparat!$A$2:$E$9998,5,FALSE)),\"\",VLOOKUP(B20,Preparat!$A$2:$E$9998,5)))","v":""},{"$f":"IF(IF(ISNA(VLOOKUP(B20,Preparat!$A$2:$E$322,4,FALSE)),\"\",VLOOKUP(B20,Preparat!$A$2:$E$322,4))<1901-1-1,\"\",IF(ISNA(VLOOKUP(B20,Preparat!$A$2:$E$322,4,FALSE)),\"\",VLOOKUP(B20,Preparat!$A$2:$E$322,4)))","v":""}]
{"$rows_left_out":22}
{"sheet":"Grödor","index":5,"n_rows":61,"n_cols":7,"rows_kept":61,"cut":false,"hidden":true,"merged":[]}
["Grödor","Kategori","pH","Lerhalt","Mullhalt","Gränsvärde  lerhalt","Gränsvärde mullhalt"]
["Höstvete","Spannmål",5,1,0.1,15,2.5]
["Vårvete","Spannmål",5.0999999999999996,2,0.2]
["Råg","Spannmål",5.2,3,0.3]
["Höstkorn","Spannmål",5.3,4,0.4]
["Vårkorn","Spannmål",5.4,5,0.5]
["Havre","Spannmål",5.5,6,0.6]
["Rågvete","Spannmål",5.6,7,0.7]
["Blandsäd","Spannmål",5.7,8,0.8]
["Ärter, åkerbönor m.m.","Baljväxter, grönfoder och vall",5.8,9,0.9]
["Konservärter","Baljväxter, grönfoder och vall",5.9,10,1]
["Majs","Baljväxter, grönfoder och vall",6,11,1.1000000000000001]
["Vall","Baljväxter, grönfoder och vall",6.1,12,1.2]
["Frövall","Baljväxter, grönfoder och vall",6.2,13,1.3]
["Potatis","Potatis, sockerbetor och oljeväxter",6.3,14,1.4]
["Sockerbetor","Potatis, sockerbetor och oljeväxter",6.4,15,1.5]
["Höstraps","Potatis, sockerbetor och oljeväxter",6.5,16,1.6]
["Vårraps","Potatis, sockerbetor och oljeväxter",6.6,17,1.7]
["Höstrybs","Potatis, sockerbetor och oljeväxter",6.7,18,1.8]
["Vårrybs","Potatis, sockerbetor och oljeväxter",6.8,19,1.9]
{"$rows_left_out":41}